{"text_format":"1","workbook":"xlsx","n_sheets":11,"sheets":["Stammdaten","Juniorinnen","Junioren","Männer","Frauen","Seniorinnen A","Seniorinnen B","Seniorinnen C","Senioren A","Senioren B","Senioren C"],"not_rendered":{"charts":0,"images":1,"macros":1,"external_links":0,"defined_names":21,"comments":10,"pivot_tables":0},"unopened":[],"bounds":{"document_bytes":16777216,"sheet_cells":100000,"rows_first":2000,"rows_last":500,"rows_between":2000,"halvings":0,"cell_chars":16384,"cell_head_chars":4096},"cells_cut":0,"cells_raw":0,"read":"whole","date_system":"1900"}

{"sheet":"Stammdaten","index":0,"n_rows":22,"n_cols":9,"rows_kept":22,"cut":false,"hidden":false,"merged":[[4,3,4,8]]}
[]
["Kreiseinzelmeisterschaften - Vorrunde - Stammdaten"]
["Version:","3.0"]
[]
[null,"Achtung: Alle Angaben werden übernommen! Sollen in einigen Bereichen andere Daten angezeigt werden müssen diese manuell eingegeben werden.",null,"Bitte die Datenverarbeitungsangaben eingeben! Bitte in die Spalte \"Endlaufteilnehmer\" die Anzahl der Startplätze in der Endrunde eintragen."]
[]
["Veranstalter:","Kegelkreis Saale-Orla",null,"Nr.","Titel / Altersklasse","Ort","Endlaufteilnehmer","Datum Endlauf","Ort Endlauf"]
[null,null,null,1,"Juniorinnen",null,null,"15. April 2023","Bad Lobenstein"]
["Eventname:","Kreiseinzelmeisterschaften Vorrunde",null,2,"Junioren",null,null,"15. April 2023","Bad Lobenstein"]
["Jahr: ",2023,null,3,"Männer",null,null,"15. April 2023","Bad Lobenstein"]
["Region: ","Saale-Orla-Kreis",null,4,"Frauen",null,null,"15. April 2023","Bad Lobenstein"]
[null,null,null,5,"Seniorinnen B",null,4,"01.April 2023","Bad Lobenstein"]
[null,null,null,6,"Seniorinnen A",null,4,"01.April 2023","Bad Lobenstein"]
["Ort, Datum:","KKSO ,den 10.03.2022",null,7,"Senioren B",null,8,"01.April 2023","Bad Lobenstein"]
[null,null,null,8,"Senioren A","Neustadt",8,"01.April 2023","Bad Lobenstein"]
{"$rows_left_out":8}
{"sheet":"Juniorinnen","index":1,"n_rows":59,"n_cols":21,"rows_kept":59,"cut":false,"hidden":true,"merged":[[7,9,7,12],[0,0,0,15],[7,6,7,8],[4,6,4,11],[4,2,4,4],[5,0,5,2]]}
[{"$f":"Stammdaten!B7","v":"Kegelkreis Saale-Orla"},null,null,null,null,null,null,null,null,null,null,null,null,null,null,null,{"$f":"\"A1:O\"&COUNTIF(F$1:F$166,\">\"\"\")+7","v":"A1:O14"},"Automatischer Druckbereich"]
[{"$f":"CONCATENATE(Stammdaten!B9,\" \",Stammdaten!B10)","v":"Kreiseinzelmeisterschaften Vorrunde 2023"}]
[]
[1,".    Altersklasse: ",null,null,null,{"$f":"VLOOKUP(A4,Stammdaten!D8:G15,2,1)","v":"Juniorinnen"}]
[null,"Ort:","Ranis",null,null,"Verantwortlicher:","KSV Ranis"]
["2022-04-02",null,null,null,null,"der Endlauf findet am 09.+10.April 2022 in Wernburg statt."]
[]
["Nr:","Zeit","B","Vorname","Name","Verein","Kontrolle",null,null,"Vorlauf",null,null,null,"E","Platz","PlatzPunkte",null,"Eingabe bitte wiefolgt:"]
[null,null,null,null,null,null,"P","K","W","Volle.","Abr.","Ges.","F.",{"$f":"VLOOKUP(A4,Stammdaten!D8:G17,4,1)","v":0},null,null,null,"1. Volle"]
[1,"09:10:00",2,null,null,"Krölpa",null,null,null,null,{"$f":"L10-J10","v":0},null,1,{"$f":"IF(O10=\"\",\"\",IF(($N$9-RANK(O10,$O$10:$O$57,1))<0,\"\",\"X\"))","v":""},{"$f":"Männer!O10","v":""},{"$f":"IF(L10=\"\",\"\",RANK(L10,$L$10:$L$57,1)*10000+RANK(K10,$K$10:$K$57,1)*100+RANK(M10,$M$10:$M$57,0))","v":""},null,"2. Gesamt! (Abräumer wird automatisch berechnet!!!)"]
[2,"09:10:00",1,null,null,"Krölpa",null,null,null,null,{"$f":"L11-J11","v":0},null,null,"",{"$f":"Männer!O11","v":""},"",null,"3. FW"]
[3,"12:40:00",2,null,null,"Neustadt",null,null,null,null,0,null,null,"",{"$f":"Männer!O12","v":""},""]
[null,null,null,null,null,null,null,null,null,null,0,null,null,"",{"$f":"Männer!O13","v":""},""]
[null,null,null,null,null,null,null,null,null,null,0,null,null,"",{"$f":"Männer!O14","v":""},""]
[null,null,null,null,null,null,null,null,null,null,0,null,null,"",{"$f":"Männer!O15","v":""},""]
{"$rows_left_out":45}
{"sheet":"Junioren","index":2,"n_rows":58,"n_cols":21,"rows_kept":58,"cut":false,"hidden":true,"merged":[[7,9,7,12],[0,0,0,15],[7,6,7,8],[4,6,4,11],[4,2,4,4],[5,0,5,2]]}
[{"$f":"Stammdaten!B7","v":"Kegelkreis Saale-Orla"},null,null,null,null,null,null,null,null,null,null,null,null,null,null,null,{"$f":"\"A1:O\"&COUNTIF(F$1:F$165,\">\"\"\")+7","v":"A1:O21"},"Automatischer Druckbereich"]
[{"$f":"CONCATENATE(Stammdaten!B9,\" \",Stammdaten!B10)","v":"Kreiseinzelmeisterschaften Vorrunde 2023"}]
[]
[2,".    Altersklasse: ",null,null,null,{"$f":"VLOOKUP(A4,Stammdaten!D8:G15,2,1)","v":"Junioren"}]
[null,"Ort:","Ranis",null,null,"Verantwortlicher:","KSV Ranis"]
["2022-04-02",null,null,"der Endlauf findet am 09.+10.April 2022 in Wernburg   statt","am 09.+10.April 2022 in Wernburg",null,"statt"]
[]
["Nr:","Zeit","B","Vorname","Name","Verein","Kontrolle",null,null,"Vorlauf",null,null,null,"E","Platz","PlatzPunkte",null,null,null,null,"Eingabe bitte wiefolgt:"]
[null,null,null,null,null,null,"P","K","W","Volle.","Abr.","Ges.","F.",{"$f":"VLOOKUP(A4,Stammdaten!D8:G17,4,1)","v":0},null,null,null,null,null,null,"1. Volle"]
[1,"08.00",1,null,null,"Pößneck",null,null,null,null,{"$f":"L10-J10","v":0},null,null,{"$f":"IF(O10=\"\",\"\",IF(($N$9-RANK(O10,$O$10:$O$56,1))<0,\"\",\"X\"))","v":""},{"$f":"IF(P10=\"\",\"\",RANK(P10,$P$10:$P$56,0))","v":""},{"$f":"IF(L10=\"\",\"\",RANK(L10,$L$10:$L$56,1)*10000+RANK(K10,$K$10:$K$56,1)*100+RANK(M10,$M$10:$M$56,0))","v":""},null,null,null,null,"2. Gesamt! (Abräumer wird automatisch berechnet!!!)"]
[2,"08.00",2,null,null,"Krölpa",null,null,null,null,{"$f":"L11-J11","v":0},null,null,{"$f":"IF(O11=\"\",\"\",IF(($N$9-RANK(O11,$O$10:$O$56,1))<0,\"\",\"X\"))","v":""},{"$f":"IF(P11=\"\",\"\",RANK(P11,$P$10:$P$56,0))","v":""},"",null,null,null,null,"3. FW"]
[3,"10:20:00",1,null,null,"Ranis",null,null,null,null,0,null,null,"","",""]
[4,"10:20:00",2,null,null,"Neustadt ",null,null,null,null,0,null,null,"","",""]
[5,"11:30:00",1,null,null,"Ranis",null,null,null,null,0,null,null,"","",""]
[6,"11:30:00",2,null,null,"Pößneck",null,null,null,null,0,null,null,"","",""]
{"$rows_left_out":44}
{"sheet":"Männer","index":3,"n_rows":58,"n_cols":21,"rows_kept":58,"cut":false,"hidden":true,"merged":[[7,9,7,12],[0,0,0,15],[7,6,7,8],[4,6,4,11],[4,2,4,4],[5,0,5,2]]}
[{"$f":"Stammdaten!B7","v":"Kegelkreis Saale-Orla"},null,null,null,null,null,null,null,null,null,null,null,null,null,null,null,{"$f":"IF(Q2=0,\"A1:O\"&COUNTIF(F$1:F$157,\">\"\"\")+7,Q2)","v":"A1:O59"},"Automatischer Druckbereich"]
[{"$f":"CONCATENATE(Stammdaten!B9,\" \",Stammdaten!B10)","v":"Kreiseinzelmeisterschaften Vorrunde 2023"},null,null,null,null,null,null,null,null,null,null,null,null,null,null,null,"A1:O59"]
[]
[3,".    Altersklasse: ",null,null,null,{"$f":"VLOOKUP(A4,Stammdaten!D8:G15,2,1)","v":"Männer"}]
[null,"Ort:","Neustadt",null,null,"Verantwortlicher:","Germania Neustadt"]
["16.+17.02.19",null,null," der Endlauf findet am 09.+10. April in Wernburg statt."]
[]
["Nr:","Zeit","B","Vorname","Name","Verein","Kontrolle",null,null,"Vorlauf",null,null,null,"E","Platz","PlatzPunkte",null,null,null,null,"Eingabe bitte wiefolgt:"]
[null,null,null,null,null,null,"P","K","W","Volle.","Abr.","Ges.","F.",{"$f":"VLOOKUP(A4,Stammdaten!D8:G17,4,1)","v":0},null,null,null,null,null,null,"1. Volle"]
[1,"08:00:00",1,null,null,"Neustadt",null,null,null,null,{"$f":"L10-J10","v":0},null,null,{"$f":"IF(O10=\"\",\"\",IF(($N$9-RANK(O10,$O$10:$O$57,1))<0,\"\",\"X\"))","v":""},{"$f":"IF(P10=\"\",\"\",RANK(P10,$P$10:$P$57,0))","v":""},{"$f":"IF(L10=\"\",\"\",RANK(L10,$L$10:$L$54,1)*10000+RANK(K10,$K$10:$K$54,1)*100+RANK(M10,$M$10:$M$54,0))","v":""},null,null,null,null,"2. Gesamt (Abräumer wird automatisch berechnet!!!)"]
[2,"08:00:00",2,null,null,"Langenorla",null,null,null,null,{"$f":"L11-J11","v":0},null,null,"","","",null,null,null,null,"3. FW"]
[3,"08:00:00",3,null,null,"SV Pößneck",null,null,null,null,0,null,null,"","",""]
[4,"08:00:00",4,"Sebastian","Günther","Oppurg",null,null,null,null,0,null,null,"","",""]
[5,"09:10:00",1,null,null,"SV Pößneck",null,null,null,null,0,null,null,"","",""]
[6,"09:10:00",2,null,null,"Neustadt",null,null,null,null,0,null,null,"","",""]
{"$rows_left_out":44}
{"sheet":"Frauen","index":4,"n_rows":59,"n_cols":25,"rows_kept":59,"cut":false,"hidden":true,"merged":[[7,9,7,12],[0,0,0,15],[7,6,7,8],[4,6,4,11],[4,2,4,4],[5,0,5,2]]}
[{"$f":"Stammdaten!B7","v":"Kegelkreis Saale-Orla"},null,null,null,null,null,null,null,null,null,null,null,null,null,null,null,{"$f":"\"A1:O\"&COUNTIF(F$1:F$166,\">\"\"\")+7","v":"A1:O21"},"Automatischer Druckbereich"]
[{"$f":"CONCATENATE(Stammdaten!B9,\" \",Stammdaten!B10)","v":"Kreiseinzelmeisterschaften Vorrunde 2023"}]
[]
[4,".    Altersklasse: ",null,null,null,{"$f":"VLOOKUP(A4,Stammdaten!D8:G15,2,1)","v":"Frauen"}]
[null,"Ort:","Pößnek",null,null,"Verantwortlicher:","SV Pößneck"]
["2019-02-16",null,null,"der Endlauf findet am 09.+10.April 2022 in Wernburg statt."]
[]
["Nr:","Zeit","B","Vorname","Name","Verein","Kontrolle",null,null,"Vorlauf",null,null,null,"E","Platz","PlatzPunkte",null,null,null,null,"Eingabe bitte wiefolgt:"]
[null,null,null,null,null,null,"P","K","W","Volle.","Abr.","Ges.","F.",{"$f":"VLOOKUP(A4,Stammdaten!D8:G17,4,1)","v":0},null,null,null,null,null,null,"1. Volle"]
[1,"08:00:00",1,null,null,"SV Pößneck",null,null,null,null,{"$f":"L10-J10","v":0},null,null,{"$f":"IF(O10=\"\",\"\",IF(($N$9-RANK(O10,$O$10:$O$57,1))<0,\"\",\"X\"))","v":""},{"$f":"IF(P10=\"\",\"\",RANK(P10,$P$10:$P$57,0))","v":""},{"$f":"IF(L10=\"\",\"\",RANK(L10,$L$10:$L$57,1)*10000+RANK(K10,$K$10:$K$57,1)*100+RANK(M10,$M$10:$M$57,0))","v":""},null,null,null,null,"2. Gesamt (Abräumer wird automatisch berechnet!!!)"]
[2,"08:00:00",2,null,null,"Neustadt",null,null,null,null,{"$f":"L11-J11","v":0},null,null,"","","",null,null,null,null,"3. FW"]
[3,"08:00:00",3,null,null,"Krölpa",null,null,null,null,0,null,null,"","",""]
[4,"08:00:00",4,null,null,"Neustadt",null,null,null,null,0,null,null,"","",""]
[5,"11:30:00",1,null,null,"Grumbach",null,null,null,null,0,null,null,"","","",null,null,null,null,"Änderung 01/04/2022"]
[6,"11:30:00",2,null,null,"Wernburg",null,null,null,null,0,null,null,"","",""]
{"$rows_left_out":45}
{"sheet":"Seniorinnen A","index":5,"n_rows":59,"n_cols":21,"rows_kept":59,"cut":false,"hidden":false,"merged":[[7,9,7,12],[0,0,0,15],[7,6,7,8],[4,6,4,11],[4,2,4,4],[5,0,5,2]]}
[{"$f":"Stammdaten!B7","v":"Kegelkreis Saale-Orla"},null,null,null,null,null,null,null,null,null,null,null,null,null,null,null,{"$f":"\"A1:O\"&COUNTIF(F$1:F$166,\">\"\"\")+7","v":"A1:O17"},"Automatischer Druckbereich"]
[{"$f":"CONCATENATE(Stammdaten!B9,\" \",Stammdaten!B10)","v":"Kreiseinzelmeisterschaften Vorrunde 2023"}]
[]
[6,".    Altersklasse: ",null,null,null,{"$f":"VLOOKUP(A4,Stammdaten!D8:G15,2,1)","v":"Seniorinnen A"}]
[null,"Ort:","Pößneck",null,null,"Verantwortlicher:","1. SV Pößneck"]
[null,null,null,"der Endlauf findet am 01. April 2023 in Bad Lobenstein  statt."]
[]
["Nr:","Zeit","B","Vorname","Name","Verein","Kontrolle",null,null,"Vorlauf",null,null,null,"E","Platz","PlatzPunkte",null,null,null,null,"Eingabe bitte wiefolgt:"]
[null,null,null,null,null,null,"P","K","W","Volle.","Abr.","Ges.","F.",{"$f":"VLOOKUP(A4,Stammdaten!D8:G17,4,1)","v":4},null,null,null,null,null,null,"1. Volle"]
[1,"10:00:00",1,"Veronika","Scholz","Görkwitz",null,null,null,null,{"$f":"L10-J10","v":0},null,null,{"$f":"IF(O10=\"\",\"\",IF(($N$9-RANK(O10,$O$10:$O$57,1))<0,\"\",\"X\"))","v":""},{"$f":"IF(P10=\"\",\"\",RANK(P10,$P$10:$P$57,0))","v":""},{"$f":"IF(L10=\"\",\"\",RANK(L10,$L$10:$L$57,1)*10000+RANK(K10,$K$10:$K$57,1)*100+RANK(M10,$M$10:$M$57,0))","v":""},null,null,null,null,"2. Gesamt (Abräumer wird automatisch berechnet!!!)"]
[2,"10:00:00",2,null,null,"Neustadt",null,null,null,null,{"$f":"L11-J11","v":0},null,null,"","","",null,null,null,null,"3. FW"]
[3,"10:00:00",3,"Christiane","Schwalbe","Zwackau",null,null,null,null,0,null,null,"","",""]
[4,"10:00:00",4,"Veronika","Scholz","Görkwitz",null,null,null,null,0,null,null,"","",""]
[5,"11:10:00",1,"Seniorinnen B",null,null,null,null,null,null,0,null,null,"","",""]
[6,"11:10:00",2,"Seniorinnen B",null,null,null,null,null,null,0,null,null,"","",""]
{"$rows_left_out":45}
{"sheet":"Seniorinnen B","index":6,"n_rows":60,"n_cols":21,"rows_kept":60,"cut":false,"hidden":false,"merged":[[7,9,7,12],[0,0,0,15],[7,6,7,8],[4,6,4,11],[4,2,4,4],[5,0,5,2]]}
[{"$f":"Stammdaten!B7","v":"Kegelkreis Saale-Orla"},null,null,null,null,null,null,null,null,null,null,null,null,null,null,null,{"$f":"\"A1:O\"&COUNTIF(F$1:F$167,\">\"\"\")+7","v":"A1:O18"},"Automatischer Druckbereich"]
[{"$f":"CONCATENATE(Stammdaten!B9,\" \",Stammdaten!B10)","v":"Kreiseinzelmeisterschaften Vorrunde 2023"}]
[]
[5,".    Altersklasse: ",null,null,null,{"$f":"VLOOKUP(A4,Stammdaten!D8:G15,2,1)","v":"Seniorinnen B"}]
[null,"Ort:","Pößneck",null,null,"Verantwortlicher:","1. SV Pößneck"]
[null,null,null,"der Endlauf findet am 01. April 2023 in Bad Lobenstein  statt."]
[]
["Nr:","Zeit","B","Vorname","Name","Verein","Kontrolle",null,null,"Vorlauf",null,null,null,"E","Platz","PlatzPunkte",null,null,null,null,"Eingabe bitte wiefolgt:"]
[null,null,null,null,null,null,"P","K","W","Volle.","Abr.","Ges.","F.",4,null,null,null,null,null,null,"1. Volle"]
[1,"11:10:00",1,null,null,"Neustadt",null,null,null,null,{"$f":"L10-J10","v":0},null,null,{"$f":"IF(O10=\"\",\"\",IF(($N$9-RANK(O10,$O$10:$O$58,1))<0,\"\",\"X\"))","v":""},{"$f":"IF(P10=\"\",\"\",RANK(P10,$P$10:$P$58,0))","v":""},{"$f":"IF(L10=\"\",\"\",RANK(L10,$L$10:$L$58,1)*10000+RANK(K10,$K$10:$K$58,1)*100+RANK(M10,$M$10:$M$58,0))","v":""},null,null,null,null,"2. Gesamt (Abräumer wird automatisch berechnet!!!)"]
[2,"11:10:00",2,"Gabrielle","Kellermann","1. SV Pößneck",null,null,null,null,{"$f":"L11-J11","v":0},null,null,"","","",null,null,null,null,"3. FW"]
[3,"11:10:00",3,"Seniorinnen C",null,null,null,null,null,null,0,null,null,"","",""]
[4,"11:10:00",4,"Seniorinnen C",null,null,null,null,null,null,0,null,null,"","",""]
[5,"12:20:00",1,"Seniorinnen C"]
[6,"12:20:00",2,"Seniorinnen A",null,null,null,null,null,null,0,null,null,"","",""]
{"$rows_left_out":46}
{"sheet":"Seniorinnen C","index":7,"n_rows":61,"n_cols":31,"rows_kept":61,"cut":false,"hidden":false,"merged":[[8,9,8,12],[1,0,1,15],[8,6,8,8],[5,6,5,11],[5,2,5,4],[6,0,6,2]]}
[]
[{"$f":"Stammdaten!B7","v":"Kegelkreis Saale-Orla"}]
[{"$f":"CONCATENATE(Stammdaten!B9,\" \",Stammdaten!B10)","v":"Kreiseinzelmeisterschaften Vorrunde 2023"}]
[]
[10,".    Altersklasse: ",null,null,null,{"$f":"VLOOKUP(A5,Stammdaten!D8:G15,2,1)","v":"Senioren A"}]
[null,"Ort:","Pößneck",null,null,"Verantwortlicher:","1. SV Pößneck "]
[null,null,null,null,null,{"$f":"CONCATENATE(\"Der Endlauf findet am \",VLOOKUP(A5,Stammdaten!D8:I17,5,1),\" in \",VLOOKUP(A5,Stammdaten!D8:I17,6,1),\" statt für die Plätze 1 - \",VLOOKUP(A5,Stammdaten!D8:I17,4,1),\".\")","v":"Der Endlauf findet am 01.April 2023 in Bad Lobenstein statt für die Plätze 1 - 4."}]
[]
["Nr:","Zeit","B","Name","Vorname","Verein","Kontrolle",null,null,"Vorlauf",null,null,null,"E","Platz"]
[null,null,null,null,null,null,null,null,null,null,null,null,"F.",4]
[1,"11:10:00",3,"Edeltraut","Stankowski","Görkwitz",null,null,null,null,{"$f":"IF(L11>0,IF(L11=0,0,L11-J11),\"\")","v":""},null,null,{"$f":"IF(O11=\"\",\"\",IF(($N$10-RANK(O11,$O$11:$O$58,1))<0,\"\",\"X\"))","v":""},{"$f":"IF(P11=\"\",\"\",RANK(P11,$P$12:$P$59,0))","v":""}]
[2,"11:10:00",4,"Heidrun","Günther","1. SV Pößneck"]
[3,"12:20:00",1,"Ilona","Jahn","Neustadt"]
[]
[null,null,null,null,null,null,null,null,null,null,null,null,null,null,null,null,null,null,null,null,null,null,null,null,"S"]
{"$rows_left_out":47}
{"sheet":"Senioren A","index":8,"n_rows":59,"n_cols":21,"rows_kept":59,"cut":false,"hidden":false,"merged":[[7,9,7,12],[0,0,0,15],[7,6,7,8],[4,6,4,11],[5,0,5,2],[4,1,4,4]]}
[{"$f":"Stammdaten!B7","v":"Kegelkreis Saale-Orla"},null,null,null,null,null,null,null,null,null,null,null,null,null,null,null,{"$f":"\"A1:O\"&COUNTIF(F$1:F$166,\">\"\"\")+7","v":"A1:O32"},"Automatischer Druckbereich"]
[{"$f":"CONCATENATE(Stammdaten!B9,\" \",Stammdaten!B10)","v":"Kreiseinzelmeisterschaften Vorrunde 2023"}]
[]
[8,".    Altersklasse: ",null,null,null,{"$f":"VLOOKUP(A4,Stammdaten!D8:G15,2,1)","v":"Senioren A"}]
[null,"Ort :Neustadt / Orla",null,null,null,"Verantwortlicher:","KSV 1990 Neustadt"]
[null,null,null,"der Endlauf findet am 01. April 2023 in Bad Lobenstein statt."]
[]
["Nr:","Zeit","B","Vorname","Name","Verein","Kontrolle",null,null,"Vorlauf",null,null,null,"E","Platz","PlatzPunkte",null,"Eingabe bitte wiefolgt:"]
[null,null,null,null,null,null,"P","K","W","Volle.","Abr.","Ges.","F.",{"$f":"VLOOKUP(A4,Stammdaten!D8:G17,4,1)","v":8},null,null,null,"1. Volle"]
[1,"10:00:00",1,null,null,"Gahma",null,null,null,null,{"$f":"L10-J10","v":0},null,null,{"$f":"IF(O10=\"\",\"\",IF(($N$9-RANK(O10,$O$10:$O$57,1))<0,\"\",\"X\"))","v":""},{"$f":"IF(P10=\"\",\"\",RANK(P10,$P$10:$P$57,0))","v":""},{"$f":"IF(L10=\"\",\"\",RANK(L10,$L$10:$L$57,1)*10000+RANK(K10,$K$10:$K$57,1)*100+RANK(M10,$M$10:$M$57,0))","v":""},null,"2. Gesamt (Abräumer wird automatisch berechnet!!!)"]
[2,"10:00:00",2,"Mirko","Schumann","Triptis",null,null,null,null,0,null,null,"","","",null,"3. FW"]
[3,"10:00:00",3,"Karsten","Leheis","Görkwitz ",null,null,null,null,0,null,null,"","",""]
[4,"10:00:00",4,"Jens","Glöckner","Triptis",null,null,null,null,0,null,null,"","",""]
[5,"11:10:00",1,"Sven","Wunderlich","Gefell",null,null,null,null,0,null,null,"","",""]
[6,"11:10:00",2,"Jörg ","Unfried","Eliasbrunn",null,null,null,null,0,null,null,"","",""]
{"$rows_left_out":45}
{"sheet":"Senioren B","index":9,"n_rows":59,"n_cols":18,"rows_kept":59,"cut":false,"hidden":false,"merged":[[7,9,7,12],[0,0,0,15],[7,6,7,8],[4,6,4,11],[4,2,4,4],[5,0,5,2]]}
[{"$f":"Stammdaten!B7","v":"Kegelkreis Saale-Orla"},null,null,null,null,null,null,null,null,null,null,null,null,null,null,null,{"$f":"\"A1:O\"&COUNTIF(F$1:F$166,\">\"\"\")+7","v":"A1:O35"},"Automatischer Druckbereich"]
[{"$f":"CONCATENATE(Stammdaten!B9,\" \",Stammdaten!B10)","v":"Kreiseinzelmeisterschaften Vorrunde 2023"}]
[]
[7,".    Altersklasse: ",null,null,null,{"$f":"VLOOKUP(A4,Stammdaten!D8:G15,2,1)","v":"Senioren B"}]
[null,"Ort:","Wernburg",null,null,"Verantwortlicher:","SV Wernburg "]
[null,null,null,"der Endlauf findet am 01. April 2023 in Bad Lobenstein  statt."]
[]
["Nr:","Zeit","B","Vorname","Name","Verein","Kontrolle",null,null,"Vorlauf",null,null,null,"E","Platz","PlatzPunkte",null,"Eingabe bitte wiefolgt:"]
[null,null,null,null,null,null,"P","K","W","Volle.","Abr.","Ges.","F.",{"$f":"VLOOKUP(A4,Stammdaten!D8:G17,4,1)","v":8},null,null,null,"1. Volle"]
[null,"Freitag 17.02.2023",null,null,null,null,null,null,null,null,{"$f":"L10-J10","v":0},null,null,{"$f":"IF(O10=\"\",\"\",IF(($N$9-RANK(O10,$O$10:$O$57,1))<0,\"\",\"X\"))","v":""},{"$f":"IF(P10=\"\",\"\",RANK(P10,$P$10:$P$57,0))","v":""},{"$f":"IF(L10=\"\",\"\",RANK(L10,$L$10:$L$57,1)*10000+RANK(K10,$K$10:$K$57,1)*100+RANK(M10,$M$10:$M$57,0))","v":""},null,"2. Gesamt (Abräumer wird automatisch berechnet!!!)"]
[1,"16:30:00",1,"Senioren C",null,null,null,null,null,null,0,null,null,{"$f":"IF(O11=\"\",\"\",IF(($N$9-RANK(O11,$O$10:$O$57,1))<0,\"\",\"X\"))","v":""},{"$f":"IF(P11=\"\",\"\",RANK(P11,$P$10:$P$57,0))","v":""},"",null,"3. FW"]
[2,"16:30:00",2,"Senioren C",null,null,null,null,null,null,0,null,null,"","",""]
[3,"16:30:00",3,"Senioren C",null,null,null,null,null,null,0,null,null,"","",""]
[4,"16:30:00",4,"Volker","Hopf","Tanna",null,null,null,null,0,null,null,"","",""]
[5,"17:40:00",1,"Rafael","Caspari","Krölpa",null,null,null,null,0,null,null,"","",""]
{"$rows_left_out":45}
{"sheet":"Senioren C","index":10,"n_rows":56,"n_cols":21,"rows_kept":56,"cut":false,"hidden":false,"merged":[[7,9,7,12],[0,0,0,15],[7,6,7,8],[4,6,4,11],[4,2,4,4],[5,0,5,2]]}
[{"$f":"Stammdaten!B7","v":"Kegelkreis Saale-Orla"},null,null,null,null,null,null,null,null,null,null,null,null,null,null,null,{"$f":"\"A1:O\"&COUNTIF(F$1:F$163,\">\"\"\")+7","v":"A1:O24"},"Automatischer Druckbereich"]
[{"$f":"CONCATENATE(Stammdaten!B9,\" \",Stammdaten!B10)","v":"Kreiseinzelmeisterschaften Vorrunde 2023"}]
[]
[9,".    Altersklasse: ",null,null,null,{"$f":"VLOOKUP(A4,Stammdaten!D8:G17,2,1)","v":"Senioren C"}]
[null,"Ort:","Wernburg",null,null,"Verantwortlicher:","SV Wernburg"]
[null,null,null,"der Endlauf findet am 01. April 2023 in Bad Lobenstein  statt."]
[]
["Nr:","Zeit","B","Vorname","Name","Verein","Kontrolle",null,null,"Vorlauf",null,null,null,"E","Platz","PlatzPunkte",null,null,null,null,"Eingabe bitte wiefolgt:"]
[null,null,null,null,null,null,"P","K","W","Volle.","Abr.","Ges.","F.",{"$f":"VLOOKUP(A4,Stammdaten!D8:G17,4,1)","v":4},null,null,null,null,null,null,"1. Volle"]
[null,"Freitag 17.02.2023",null,null,null,null,null,null,null,null,{"$f":"L10-J10","v":0},null,null,{"$f":"IF(O10=\"\",\"\",IF(($N$9-RANK(O10,$O$10:$O$57,1))<0,\"\",\"X\"))","v":""},{"$f":"IF(P10=\"\",\"\",RANK(P10,$P$10:$P$57,0))","v":""},{"$f":"IF(L10=\"\",\"\",RANK(L10,$L$10:$L$54,1)*10000+RANK(K10,$K$10:$K$54,1)*100+RANK(M10,$M$10:$M$54,0))","v":""},null,null,null,null,"2. Gesamt! (Abräumer wird automatisch berechnet!!!)"]
[1,"16:30:00",1,"Thomas","Hegner","Tanna",null,null,null,null,0,null,null,{"$f":"IF(O11=\"\",\"\",IF(($N$9-RANK(O11,$O$10:$O$57,1))<0,\"\",\"X\"))","v":""},{"$f":"IF(P11=\"\",\"\",RANK(P11,$P$10:$P$57,0))","v":""},{"$f":"IF(L11=\"\",\"\",RANK(L11,$L$10:$L$54,1)*10000+RANK(K11,$K$10:$K$54,1)*100+RANK(M11,$M$10:$M$54,0))","v":""},null,null,null,null,"3. FW"]
[2,"16:30:00",2,"Horst","Müller","Tanna",null,null,null,null,0,null,null,"","",{"$f":"IF(L12=\"\",\"\",RANK(L12,$L$10:$L$54,1)*10000+RANK(K12,$K$10:$K$54,1)*100+RANK(M12,$M$10:$M$54,0))","v":""}]
[3,"16:30:00",3,"Günter","Schaarschmidt","Tanna",null,null,null,null,0,null,null,"",""]
[4,"16:30:00",4,"Senioren B",null,null,null,null,null,null,0,null,null,"","",{"$f":"IF(L14=\"\",\"\",RANK(L14,$L$10:$L$54,1)*10000+RANK(K14,$K$10:$K$54,1)*100+RANK(M14,$M$10:$M$54,0))","v":""}]
[5,"17:40:00",1,"Senioren B",null,null,null,null,null,null,0,null,null,"",""]
{"$rows_left_out":41}